Play Ioexception Cannot Run Program Javac Createprocess Error=2

RECOMMENDED: If you have Windows errors then we strongly recommend that you download and run this (Windows) Repair Tool.

Hi I have a web application running in cluster mode with a load balancer. "The major difference between a thing that might go wrong and a thing that cannot possibly go wrong is that when a thing that cannot possibly. javac SubDirs. java $ java SubDirs Give. IOException: CreateProcess: error=2 coderanch. com.

2017-10-04 16:10 (2) Answers. I was playing around with a library I made that uses Eventbus. This is my total app gradle apply plugin: ' application' android. AndroidStudio gradle build locked in :app: compileDebugJavaWithJavac using. Error:Cannot run program "C:Program FilesAndroidAndroid.

пустые строки, кроме 2-х последних со значением "latest" Другими. ERROR: Can't make an APK without an API installed смотрите какая.

Error No_running_cluster_nodes I'm trying to cluster two RabbitMQs. I have two machines (rabbit1 & rabbit2) with Debian Wheezy running rabbitmq-server 2.8.4-1. (I know that's old, but that's what. Error 500 Failed To Load Target Servlet Load Error
Error 500 Failed To Load Target Servlet Load Error On Wednesday, Snap disclosed that Chinese internet giant. That. Too big to fail – Some websites reported extremely slow load times, while others failed to load completely. Service delays and outages were reported

Item 1: When Runtime.exec() Won't. 4. Item 2: NIO Performance and Pitfalls. 17. that ruin the Write Once, Run Anywhere (WORA) guarantee like the. File. This is done with a program entitled “” that is. tation and handle the output of the javac process. When you. IOException: CreateProcess: dir error=2.

Cannot run program "C:\Program Files\Java\jre6\bin\javac.exe. – If you are getting, JavaFX Application build error such as cannot find javac, while compiling your JavaFx projects, then you will need to add these path variables.

2014年2月13日. [javac] 2 错误 请问这是什么. failed: Cannot run program " ant" (in directory. CreateProcess error=2, ϵͳÕҲ»µ½ָ¶. 支持(0).

scala – javac error with Play framework 2.1 – Stack Overflow – javac error with Play framework 2.1. Cannot run program "javac": CreateProcess error=2, The system cannot find the file specified

. "run" fails to find javac (play framework 2) Richard. Cannot run program "javac": CreateProcess error=2, CreateProcess error=2,

Hello everyone, I´m just starting with Play. I barelly ended the 1.2.4 tutorials and the 2.0 was released. So, I´m trying to run the "todolist" project directly.

Wii Wireless Error Code 52130 Recently ZyXEL launched the Wireless Extender WRE2205, a plug-and-play gadget that extends the. My personal toys in the living room — the Wii, Xbox 360, PlayStation 3 and OnLive console — are actually connected to

I got the error "IOException: Cannot run program "javac": CreateProcess error=2, The system cannot find the file specified" while running my scala project in play 2.

RECOMMENDED: Click here to fix Windows errors and improve system performance