Error Undeclared First Use In This Function C



Complete Solution Is In The Short TUTORIAL

RECOMMENDED: If you have Windows errors then we strongly recommend that you download and run this (Windows) Repair Tool.

#define SQLITE_VTAB_CONSTRAINT_SUPPORT 1 These macros define the various options to the sqlite3_vtab_config() interface that virtual table implementations can use to.

use that. c. Otherwise, attempt to get a token silently. Call _renewIdToken(callback) for an id token, or _renewToken(resource, callback) for an access token.

variable ' undeclared (first use in this function): In C and C++ variables must be. This error message indicates that the compiler has encountered a variable.

term.c. error: undeclared (first use in this function) #1402. Closed. g36054 opened this Issue on Nov 5, 2014 · 17 comments.

Installer Internal Error 2343 Aug 22, 2012  · SubInACL is a command-line tool that enables administrators to obtain security information about files, registry keys, and services, and transfer this. They use the existence of complicated internal procedures as an excuse

hello, we are having problems in compiling a 'slightly' altered x264. We are always receiving a 'helloWorld' undeclared (first use this function) error.

In "classic" C language (C89/90) when you call an undeclared function, C assumes that it returns an int and also attempts to derive the types of its parameters from.

C variable undeclared (first use in function). 'actual_ouput' undeclared (first use in this function) main.c:25: error: (Each undeclared identifier is reported.

C compilation errors: undeclared (first use in this. The first error; i2cset.c: In function 'check_funcs. 'I2C_SMBUS_BYTE' undeclared (first use in this function)

Error Handling In VBA – CPearson.com – Introduction. Error handling refers to the programming practice of anticipating and coding for error conditions that may arise when your program runs.

Node:.undeclared (first use in this function), Next:Run-time errors, This is similar to the undefined reference to. error, but instead of referring to an undefined.

But, should we really use arrow functions in class field properties? First of all. of our parent class overrides it. C.prototype.handleClick() will call our implementation but will fail with the previous error: Uncaught TypeError:.

Jan 15, 2015. gcc -g -Wall assign1.c main.c -o test main.c: In function 'byte_sort_test1': main.c: 25: error: 'actual_ouput' undeclared (first use in this function).

error in C – `system' undeclared (first use this function). C / C++ Forums on Bytes.

1.1 What is XSLT? This specification defines the syntax and semantics of the XSLT 2.0 language. The term stylesheet reflects the fact that one of the important roles.

You might get this error if you tried to refer to. undec.c:10: `my_int' undeclared (first use in this function) undec.c:10: (Each undeclared identifier is.

I am working on the ‘driver’ part of my programing assignment and i keep getting this absurd error: error C2065: ‘cout’ : undeclared identifier I have even tried.

We don’t have to use variables unless we want to do so. you’ve just written your first Python function! If instead you get a syntax error, remember that you can easily edit a function by 1) moving the cursor to any line of the function.

Feb 29, 2016. struct Statistics stats[5]; is local variable in the block used in for statement, so it isn 't visible after the for loop. Get it out of for statement.

Jul 2, 2013. 'a' undeclared (first use in this function) Error. Hello Programmers, I am trying to make a program that will allow a user to enter their name, from.

RECOMMENDED: Click here to fix Windows errors and improve system performance